{"text_format":"2","workbook":"xlsx","n_sheets":6,"sheets":["User Guide","User Input Model","Results","Example","TRU Fuel References","Fresh Fuel References"],"not_rendered":{"charts":1,"images":0,"macros":0,"external_links":0,"defined_names":0,"comments":0,"pivot_tables":0},"unopened":[],"bounds":{"document_bytes":16777216,"sheet_cells":100000,"run_cost":"one","rows_first":2000,"rows_last":500,"rows_between":2000,"halvings":0,"cell_chars":16384,"cell_head_chars":4096},"cells_cut":0,"cells_raw":0,"read":"whole","date_system":"1900"}

{"sheet":"User Guide","index":0,"n_rows":56,"n_cols":1,"rows_kept":56,"cut":false,"hidden":false,"merged":[]}
["Advanced Nuclear Fuel LCOF Estimation Tool"]
["User Guide"]
["This tool is to enable preliminary cost of fuel estimates for new fuel concepts using spent nuclear fuel (SNF) as the nuclear materials source."]
[]
["Reminder: Use of this tool and submission in the application package is OPTIONAL."]
["When choosing to use this tool, applicants should be aware of the following key assumptions, both which may lead to underestimation of fuel costs:"]
["1) There are no costs associated with acquiring SNF feedstock."]
["2) 100% of the limiting nuclear material in the SNF feedstock can be recovered. This minimizes the quantity of SNF mass needed to meet nuclear material input requirements and the mass to be reprocessed, which minimizes the cost of reprocessing (also assuming that reprocessing cost is only a function of the mass to be reprocessed). The limiting nuclear material is the lowest ratio of feedstock fraction to fuel mass fraction. For example, Pu (feedstock fraction = 0.01 and fuel mass fraction = 0.20) is the limiting material in the TRU Fuel References used here."]
[]
["Requirements for data justification are highlighted in red."]
[]
["START HERE:"]
["Data needs"]
["In order to use this tool, applicants will need to be able to estimate the following for their proposed fuel:"]
["Fuel composition"]
["Fuel mass fraction - U (kg U/kg fuel, the fraction of U in the fuel by mass)"]
["Fuel mass fraction - Pu (kg Pu/kg fuel, the fraction of Pu in the fuel by mass)"]
["Fuel mass fraction - Other nuclear materials (kg other nuclear material/kg fuel, the fraction of other nuclear material in the fuel by mass)"]
["Feedstock composition, where feedstock = spent fuel or other nuclear waste material that will be reprocessed for use in fuel fabrication"]
["Feedstock fraction - U (kg U/kg SNF feedstock, the fraction of U in the feedstock by mass)"]
["Feedstock fraction - Pu (kg Pu/kg SNF feedstock, the fraction of Pu in the feedstock by mass)"]
["Feedstock fraction - Other nuclear material (kg other nuclear material/kg SNF feedstock, the fraction of other nuclear material in the feedstock by mass)"]
["Fuel specifications"]
["Total fuel in reactor core (kg fuel/core)"]
["Fuel burnup (GWd/ton of fuel)"]
["Thermal efficiency (percent of burnup energy converted to electricity)"]
["System costs"]
["Recycled SNF storage (USD/ton of SNF stored)"]
["Reprocessing cost (USD/ton of heavy metal input)"]
["Fabrication cost (USD/ton of heavy metal input)"]
["Fabrication material efficiency (heavy metal output in fuel/heavy metal input to fabrication)"]
["Applicants may use the provided reference values during application if sufficient explanation for each is provided in the Notes."]
[]
[]
["Data input"]
["Navigate to the User Input Model sheet."]
[]
["Edit cells that are highlighted in yellow."]
["Provide a name for the proposed fuel."]
["To access reference cost data specific to Metal or Ceramic Fuels using TRU feestocks, select the fuel type of interest from the pull down menu. Note: These data sets are just for reference and should not discourage applicants from proposing fuels outside these types."]
{"$rows_left_out":17}
{"sheet":"User Input Model","index":1,"n_rows":36,"n_cols":7,"rows_kept":36,"cut":false,"hidden":false,"merged":[[1,0,1,1]]}
["Advanced Nuclear Fuel LCOF Estimation Tool",{"$nulls":5},"Key"]
["User Input Model",{"$nulls":5},"User input fields"]
["Name for proposed fuel:","Proposed TRU fuel","<Enter your fuel name here",null,null,null,"Reference data sets"]
["Select a TRU Fuel Reference dataset:","Metal fuel","<Select from the reference datasets available",null,null,null,"Metal fuel"]
[{"$nulls":6},"Ceramic fuel"]
["1) User inputs"]
["Value description","Units",{"$f":"B3","v":"Proposed TRU fuel"},"Reference","Notes"]
["Fuel mass fraction - U","kg U/kg fuel",null,{"$f":"'TRU Fuel References'!C8","v":0.7}]
["Fuel mass fraction - Pu","kg Pu/kg fuel",null,{"$f":"'TRU Fuel References'!C9","v":0.2}]
["Fuel mass fraction - Other nuclear material","kg other/kg fuel",null,0]
["Feedstock fraction - U","kg U/kg SNF",null,0.95]
["Feedstock fraction - Pu","kg Pu/kg SNF",null,0.01]
["Feedstock fraction - Other nuclear material","kg other/kg SNF",null,0.04]
["Total fuel in reactor core","kg fuel/core",null,3010]
["Recycled SNF storage","USD/kg SNF",null,{"$f":"'TRU Fuel References'!C24","v":1239.75}]
["Reprocessing","USD/kg SNF",null,{"$f":"'TRU Fuel References'!C63","v":2610}]
["Fabrication","USD/kg HM",null,{"$f":"IF($B$4=$G$5,'TRU Fuel References'!C64,IF(B4=G4,'TRU Fuel References'!C27-'User Input Model'!D16,0))","v":783}]
["Fabrication material efficiency","material out/material in",null,0.9]
["Fuel burnup","GWd/ton",null,150]
["Thermal efficiency","percent",null,45]
[]
["2) Calculations (Do not edit)"]
["Value description","Units",{"$f":"B3","v":"Proposed TRU fuel"},"Reference","Notes"]
["Fuel mass input - U","kg U/core",{"$f":"C8*C14","v":0},{"$f":"D8*D14","v":2107}]
["Fuel mass input - Pu","kg Pu/core",{"$f":"C9*C14","v":0},{"$f":"D9*D14","v":602}]
["Fuel mass input - Other nuclear material","kg other/core",{"$f":"C10*C14","v":0},{"$f":"D10*D14","v":0}]
["SNF needed to meet material input requirements","kg SNF/kg fuel",{"$f":"IF(C9>0,IF(C10>0,MAX(C8/C11,C9/C12,C10/C13),MAX(C8/C11,C9/C12)),IF(C10>0,MAX(C10/C13,C8/C11),C8/C11))","v":{"$error":"#DIV/0!"}},{"$f":"D9/D12","v":20}]
["HM mass to be reprocessed, lifetime","kg SNF/core",{"$f":"C27*C14","v":{"$error":"#DIV/0!"}},{"$f":"D27*D14","v":60200}]
["Recycled SNF storage, lifetime","USD/core",{"$f":"C15*C28","v":{"$error":"#DIV/0!"}},{"$f":"D15*D28","v":74632950}]
["Reprocessing, lifetime","USD/core",{"$f":"C28*C16","v":{"$error":"#DIV/0!"}},{"$f":"D28*D16","v":157122000}]
["Fabrication, lifetime","USD/core",{"$f":"C17*SUM(C24:C26)/C18","v":{"$error":"#DIV/0!"}},{"$f":"D17*SUM(D24:D25)/D18","v":2356830}]
["Energy production per core","MWh/core",{"$f":"C19*C14*24*C20/100","v":0},{"$f":"D19*(D24+D25)/SUM(D8:D9)*24*D20/100","v":4876200.0000000009}]
["Total cost through fabrication","USD/core",{"$f":"SUM(C29,C30,C31)","v":{"$error":"#DIV/0!"}},{"$f":"SUM(D29,D30,D31)","v":234111780}]
["LCOF in 2025 dollars","USD/MWh",{"$f":"C33/C32","v":{"$error":"#DIV/0!"}},{"$f":"D33/D32","v":48.011111111111099}]
[]
["Navigate to the Results sheet to compare the proposed TRU fuel cost to the cost of fresh LEU and HALEU-based fuels."]

{"sheet":"Results","index":2,"n_rows":9,"n_cols":9,"rows_kept":9,"cut":false,"hidden":false,"merged":[[5,0,7,0],[8,0,8,1]]}
["Advanced Nuclear Fuel LCOF Estimation Tool"]
["Tool Results"]
["Compare estimates of LCOF for the proposed TRU fuel to cost estimates for LEU and HALEU-based fuels"]
[]
[null,null,"Milling and mining","Conversion","Enrichment","Recycled SNF storage","Reprocessing","Fabrication","Total"]
["Fresh Fuel References","LEU",{"$f":"'Fresh Fuel References'!C16/'Fresh Fuel References'!C26","v":5.0481481481481483},{"$f":"'Fresh Fuel References'!C18/'Fresh Fuel References'!C26","v":0.68348770833333328},{"$f":"'Fresh Fuel References'!C21/'Fresh Fuel References'!C26","v":3.6157530133928568},null,null,{"$f":"'Fresh Fuel References'!C23/'Fresh Fuel References'!C26","v":1.4603571428571427},{"$f":"SUM(C6:H6)","v":10.807746012731481}]
[null,"U-Zr HALEU",{"$f":"'Fresh Fuel References'!C36/'Fresh Fuel References'!C46","v":4.5111111111111111},{"$f":"'Fresh Fuel References'!C38/'Fresh Fuel References'!C46","v":0.60316375000000011},{"$f":"'Fresh Fuel References'!C41/'Fresh Fuel References'!C46","v":14.973611111111113},null,null,{"$f":"'Fresh Fuel References'!C43/'Fresh Fuel References'!C46","v":0.33333333333333337},{"$f":"SUM(C7:H7)","v":20.421219305555557}]
[null,"Ceramic HALEU",{"$f":"'Fresh Fuel References'!C56/'Fresh Fuel References'!C67","v":4.5111111111111111},{"$f":"'Fresh Fuel References'!C58/'Fresh Fuel References'!C67","v":0.60316375000000011},{"$f":"'Fresh Fuel References'!C61/'Fresh Fuel References'!C67","v":14.973611111111113},null,null,{"$f":"'Fresh Fuel References'!C64/'Fresh Fuel References'!C67","v":8.7805555555555568},{"$f":"SUM(C8:H8)","v":28.868441527777783}]
[{"$f":"'User Input Model'!B3","v":"Proposed TRU fuel"},{"$nulls":4},{"$f":"'User Input Model'!C29/'User Input Model'!C32","v":{"$error":"#DIV/0!"}},{"$f":"'User Input Model'!C30/'User Input Model'!C32","v":{"$error":"#DIV/0!"}},{"$f":"'User Input Model'!C31/'User Input Model'!C32","v":{"$error":"#DIV/0!"}},{"$f":"SUM(C9:H9)","v":{"$error":"#DIV/0!"}}]

{"sheet":"Example","index":3,"n_rows":34,"n_cols":7,"rows_kept":34,"cut":false,"hidden":false,"merged":[[1,0,1,1]]}
["Advanced Nuclear Fuel LCOF Estimation Tool",{"$nulls":5},"Key"]
["User Input Model",{"$nulls":5},"User input fields"]
["Name for proposed fuel:","Proposed TRU fuel","<Enter your fuel name here",null,null,null,"Reference data sets"]
["Select a TRU Fuel Reference dataset:","Metal fuel","<Select from the reference datasets available",null,null,null,"Metal fuel"]
[{"$nulls":6},"Ceramic fuel"]
["1) User inputs"]
["Value description","Units",{"$f":"B3","v":"Proposed TRU fuel"},"Reference","Notes"]
["Fuel mass fraction - U","kg U/kg fuel",{"$f":"D8","v":0.7},{"$f":"'TRU Fuel References'!C8","v":0.7}]
["Fuel mass fraction - Pu","kg Pu/kg fuel",0.16,{"$f":"'TRU Fuel References'!C9","v":0.2}]
["Fuel mass fraction - Other nuclear material","kg other/kg fuel",0.04,0]
["Feedstock fraction - U","kg U/kg SNF",{"$f":"D11","v":0.95},0.95]
["Feedstock fraction - Pu","kg Pu/kg SNF",{"$f":"0.02","v":0.02},0.01]
["Feedstock fraction - Other nuclear material","kg other/kg SNF",{"$f":"0.04","v":0.04},0.04]
["Total fuel in reactor core","kg fuel/core",2800,3010]
["Recycled SNF storage","USD/kg SNF",550,{"$f":"'TRU Fuel References'!C24","v":1239.75}]
["Reprocessing","USD/kg SNF",1800,{"$f":"'TRU Fuel References'!C63","v":2610}]
["Fabrication","USD/kg HM",950,{"$f":"IF($B$4=$G$5,'TRU Fuel References'!C64,IF(B4=G4,'TRU Fuel References'!C27-Example!D16,0))","v":783}]
["Fabrication material efficiency","material out/material in",{"$f":"D18","v":0.9},0.9]
["Fuel burnup","GWd/ton",165,150]
["Thermal efficiency","percent",50,45]
[]
["2) Calculations (Do not edit)"]
["Value description","Units",{"$f":"B3","v":"Proposed TRU fuel"},"Reference","Notes"]
["Fuel mass input - U","kg U/core",{"$f":"C8*C14","v":1959.9999999999998},{"$f":"D8*D14","v":2107}]
["Fuel mass input - Pu","kg Pu/core",{"$f":"C9*C14","v":448},{"$f":"D9*D14","v":602}]
["Fuel mass input - Other nuclear material","kg other/core",{"$f":"C10*C14","v":112},{"$f":"D10*D14","v":0}]
["SNF needed to meet material input requirements","kg SNF/kg fuel",{"$f":"IF(C9>0,IF(C10>0,MAX(C8/C11,C9/C12,C10/C13),MAX(C8/C11,C9/C12)),IF(C10>0,MAX(C10/C13,C8/C11),C8/C11))","v":8},{"$f":"D9/D12","v":20}]
["HM mass to be reprocessed, lifetime","kg SNF/core",{"$f":"C27*C14","v":22400},{"$f":"D27*D14","v":60200}]
["Recycled SNF storage, lifetime","USD/core",{"$f":"C15*C28","v":12320000},{"$f":"D15*D28","v":74632950}]
["Reprocessing, lifetime","USD/core",{"$f":"C28*C16","v":40320000},{"$f":"D28*D16","v":157122000}]
["Fabrication, lifetime","USD/core",{"$f":"C17*SUM(C24:C26)/C18","v":2660000},{"$f":"D17*SUM(D24:D25)/D18","v":2356830}]
["Energy production per core","MWh/core",{"$f":"C19*C14*24*C20/100","v":5544000},{"$f":"D19*(D24+D25)/SUM(D8:D9)*24*D20/100","v":4876200.0000000009}]
["Total cost through fabrication","USD/core",{"$f":"SUM(C29,C30,C31)","v":55300000},{"$f":"SUM(D29,D30,D31)","v":234111780}]
["LCOF in 2025 dollars","USD/MWh",{"$f":"C33/C32","v":9.974747474747474},{"$f":"D33/D32","v":48.011111111111099}]

{"sheet":"TRU Fuel References","index":4,"n_rows":73,"n_cols":8,"rows_kept":73,"cut":false,"hidden":false,"merged":[[0,0,0,7],[1,0,1,1]]}
["Advanced Nuclear Fuel LCOF Estimation Tool"]
["TRU Fuel Reference Data"]
[null,"Cumulative inflation from 2017 to 2025",30.5,null,null,"%","Inflation Calculator | Find US Dollar's Value From 1913-2025"]
[]
[null,"TRU Metal Fuel (Example: U-Pu-Zr)"]
[null,"Value description","Default","Upper ","Lower","Units","Source","Notes"]
[null,"Reactor lifetime",50,null,null,"years","Assumption"]
[null,"Fuel mass fraction - U",0.7,null,null,"kg U/kg fuel","Assumption"]
[null,"Fuel mass fraction - Pu",0.2,null,null,"kg Pu/kg fuel","Assumption"]
[null,"Fuel mass fraction - Zr",0.1,null,null,"kg Zr/kg fuel","Assumption"]
[null,"Total fuel in reactor core",3000,null,null,"kg fuel/assembly","Assumption"]
[null,"Fuel cycle",100,null,null,"days","Assumption"]
[null,"Cycles per lifetime",{"$f":"C7*365/$C12","v":182.5},null,null,"cycles/lifetime","Calculated"]
[null,"Fuel mass input - U",{"$f":"$C8*C$11*C$13","v":383250},null,null,"kg U/lifetime","Calculated"]
[null,"Fuel mass input - Pu",{"$f":"$C9*C$11*C$13","v":109500},null,null,"kg Pu/lifetime","Calculated"]
[null,"Fuel mass input - Zr",{"$f":"$C10*C$11*C$13","v":54750},null,null,"kg Zr/lifetime","Calculated"]
[null,"SNF utilization for U",1,null,null,"kg SNF/kg U input","Assumption","Assuming 100% of U supply comes from SNF"]
[null,"Feedstock Pu fraction - High-Pu feedstock",0.2,null,null,"kg Pu/kg SNF","Assumption","Assuming feedstock has at least 20% Pu"]
[null,"Feedstock Pu fraction - SNF feedstock",0.01,null,null,"kg Pu/kg SNF","Assumption","Assuming conventional SNF feedstock"]
[null,"SNF utilization for Pu - High-Pu feedstock",{"$f":"C9/C18","v":1},null,null,"kg SNF/kg fuel","Calculated"]
[null,"SNF utilization for Pu - SNF feedstock",{"$f":"C9/C19","v":20},null,null,"kg SNF/kg fuel","Calculated"]
[null,"HM mass to be reprocessed, lifetime - High-Pu feedstock",{"$f":"IF(1/C18>1/C17,C15/C18,C14/C17)","v":547500},null,null,"kg HM from SNF/lifetime","Calculated","amount of input material that requires reprocessing"]
[null,"HM mass to be reprocessed, lifetime - SNF feedstock",{"$f":"IF(1/C19>1/C17,C15/C19,C14/C17)","v":10950000},null,null,"kg HM from SNF/lifetime","Calculated","amount of input material that requires reprocessing"]
[null,"Recycled combined actinide product storage, Line E3-1b, unit",{"$f":"950*(1+$C$3/100)","v":1239.75},{"$f":"1300*(1+$C$3/100)","v":1696.5},{"$f":"712*(1+$C$3/100)","v":929.16},"USD/kg SNF","Adv Fuel Cycle Cost Basis 2017, Table S-1","Assuming co-location; Default is the middle of 3 values, corrected for 2017 to 2025 inflation"]
[null,"Recycled combined actinide product storage, Line E3-1b, lifetime, HPF",{"$f":"C24*$C$22","v":678763125},{"$f":"D24*$C$22","v":928833750},508715100,"USD/lifetime","Calculated"]
[null,"Recycled combined actinide product storage, Line E3-1b, lifetime, SNF",{"$f":"C24*$C$23","v":13575262500},{"$f":"D24*$C$23","v":18576675000},{"$f":"E24*$C$23","v":10174302000},"USD/lifetime","Calculated"]
[null,"Reprocessing - Electrochemical & \nRH Fuel Recycle (incl. refabrication), Line F2/D2, unit",{"$f":"2600*(1+$C$3/100)","v":3393},{"$f":"3200*(1+$C$3/100)","v":4176},{"$f":"2000*(1+$C$3/100)","v":2610},"USD/kg HM","Adv Fuel Cycle Cost Basis 2017, Table S-1","corrected for 2017 to 2025 inflation"]
[null,"Reprocessing, unit",{"$f":"2000*(1+$C$3/100)","v":2610},null,null,"USD/kg HM","Assumption","based on typical aqueous reprocessing costs in Adv Fuel Cycle Cost Basis 2017, Table S-1. Applicants may utilize reprocessing costs developed through CURIE program"]
[null,"Refabrication, unit",{"$f":"C27-C28","v":783},null,null,"USD/kg HM","Calculated"]
[null,"Reprocessing, lifetime, HPF",{"$f":"C28*$C$22","v":1428975000},{"$f":"D27*$C$22","v":2286360000},{"$f":"E27*$C$22","v":1428975000},"USD/lifetime","Calculated"]
[null,"Reprocessing, lifetime, SNF",{"$f":"C28*$C$23","v":28579500000},{"$f":"D27*$C$23","v":45727200000},{"$f":"E27*$C$23","v":28579500000},"USD/lifetime","Calculated"]
[null,"Fabrication efficiency",0.9,null,null,"material out/material in","Placeholder"]
[null,"Refabrication, lifetime",{"$f":"C29*SUM(C14:C15)/C32","v":428692500},{"$f":"C29*SUM(D14:D15)/C32","v":0},{"$f":"C29*SUM(E14:E15)/C32","v":0},"USD/lifetime","Calculated"]
[null,"Fuel burnup",150,200,50,"GWd/ton","Assumption","https://fuelcycleoptions.inl.gov/SiteAssets/SitePages/Home/182926.pdf"]
[null,"Thermal efficiency",45,50,45,"percent","Assumption","Notes from meeting with NPD team"]
[null,"Lifetime energy production",{"$f":"C34*(C14+C15+C16)*24*C35/100","v":886950000},{"$f":"D34*(C14+C15+C16)*24*D35/100","v":1314000000},{"$f":"E34*(C14+C15+C16)*24*C35/100","v":295650000},"MWh/lifetime","Calculated"]
[null,"Total lifetime cost through fabrication",{"$f":"SUM(C26,C31,C33)","v":42583455000},{"$f":"SUM(D26,D31,D33)","v":64303875000},{"$f":"SUM(E26,E31,E33)","v":38753802000},"USD/lifetime","Calculated"]
[null,"LCOF in 2025 dollars",{"$f":"C37/$C$36","v":48.011111111111113},{"$f":"D37/$E$36","v":217.5},{"$f":"E37/$D$36","v":29.492999999999999},"USD/MWh","Calculated"]
[]
[null,"TRU Ceramic Fuel (Pu)"]
{"$rows_left_out":34}
{"sheet":"Fresh Fuel References","index":5,"n_rows":69,"n_cols":8,"rows_kept":69,"cut":false,"hidden":false,"merged":[[0,0,0,7],[1,0,1,1]]}
["Advanced Nuclear Fuel LCOF Estimation Tool"]
["Fresh Fuel Reference Data"]
[null,"General"]
[null,"Value description","Default","Upper ","Lower","Units","Source(s)","Notes"]
[null,"Production rate",1000,null,null,"MWe","Placeholder"]
[null,"Reactor lifetime",40,null,null,"years","Placeholder"]
[null,"Lifetime energy production",{"$f":"C5*24*365*C6","v":350400000},null,null,"MWh/lifetime","Calculated"]
[null,"Cumulative inflation from 2017 to 2025",30.5,null,null,"%","Inflation Calculator | Find US Dollar's Value From 1913-2025"]
[]
[null,"LEU fuel"]
[null,"Value description","Default","Upper ","Lower","Units","Source(s)","Notes"]
[null,"Fuel mass fraction - U",0.94,null,null,"kg U/kg UO2 fuel","Placeholder"]
[null,"Natural Uranium Milling and Mining Cost, Line A1, unit",{"$f":"8120/40.6","v":200},{"$f":"296*(1+$C$8/100)","v":386.28},{"$f":"34*(1+$C$8/100)","v":44.37},"USD/kg U","NIA HALEU Cost Report 2023 (default); Adv Fuel Cycle Cost Basis 2017 (upper and lower)","From Table 3 in NIA HALEU Cost Report, Table S-1 in Advanced Fuel Cycle Cost Basis"]
[null,"Natural U input, lifetime",{"$f":"C15*40.6/4.5","v":9410177.777777778},null,null,"kg natural U/lifetime","NIA HALEU Cost Report 2023","0.71% to 4.95% enrichement (LEU), 40.6 kg new natural enrichment U for every 4.5 kg LEU"]
[null,"Enriched U input, lifetime",1043000,null,null,"kg enriched U/lifetime","NRC Greenhouse Gas Emissions Estimates for a Reference 1,000 MWE Reactor; Abliene Christian University Molten Salt Research Reactor","\"1,000 MWe plant is assumed to operate at 35 percent thermal efficiency and use uranium fuel enriched to 5 percent in uranium-235 (235U) with an average burnup of 40,000 megawatt days/MT for 40 years, then it will require about 1,043 tons of enriched uranium for fuel"]
[null,"Natural Uranium Milling and Mining Cost, Line A1, lifetime",{"$f":"$C$14*C13","v":1882035555.5555556},{"$f":"$C$14*D13","v":3634963472},{"$f":"$C$14*E13","v":417529588},"USD/lifetime","Calculated"]
[null,"Conversion Cost, Line B, unit",{"$f":"AVERAGE(D17:E17)","v":27.078749999999999},{"$f":"1827/40","v":45.674999999999997},{"$f":"6.5*(1+$C$8/100)","v":8.4824999999999999},"USD/kg U","NIA HALEU Cost Report 2023 (upper); Adv Fuel Cycle Cost Basis 2017 (lower)","Default is mean of two values, corrected for 2017 to 2025 inflation, , Table S-1 in Advanced Fuel Cycle Cost Basis"]
[null,"Conversion Cost, Line B, lifetime",{"$f":"C17*$C$14","v":254815851.5},{"$f":"D17*$C$14","v":429809870},{"$f":"E17*$C$14","v":79821833},"USD/lifetime","Calculated"]
[null,"Enrichment, Line C1, unit",{"$f":"125*(1+$C$8/100)","v":163.125},{"$f":"154*(1+$C$8/100)","v":200.97},{"$f":"97*(1+$C$8/100)","v":126.58499999999999},"USD/SWUs","Adv Fuel Cycle Cost Basis 2017","Default is mean of two values, corrected for 2017 to 2025 inflation, Table S-1"]
[null,"Separative work units (SWUs) required for enrichment, lifetime",{"$f":"E20","v":8263689},{"$f":"36.63/4.5*C15","v":8490020},{"$f":"7923*C15/10^3","v":8263689},"SWUs/lifetime","NIA HALEU Cost Report 2023; NRC Greenhouse Gas Emissions Estimates for a Reference 1,000 MWE Reactor","NIA Report (0.71 to 4.95% enrichment, 36.63 SWUs/4.5 kg LEU), NRC report (0.25 to 5% enrichment, 7923 SWUs/ton enriched U), conservatively assuming the lower value for calculating baseline enrichment cost"]
[null,"Enrichment, Line C1, lifetime",{"$f":"C19*$C20","v":1348014268.125},{"$f":"D19*D20","v":1706239319.4000001},{"$f":"E19*E20","v":1046059072.0649999},"USD/lifetime","Calculated"]
[null,"LWR UO2 Fuel Fab, PWR: Virgin LEU Cost, Line D1-1-1, unit",{"$f":"400*(1+$C$8/100)","v":522},{"$f":"575*(1+$C$8/100)","v":750.375},{"$f":"230*(1+$C$8/100)","v":300.14999999999998},"USD/kg HM","Adv Fuel Cycle Cost Basis 2017","Default is the middle of 3 values, corrected for 2017 to 2025 inflation, Table S-1"]
[null,"LWR UO2 Fuel Fab, PWR: Virgin LEU Cost, Line D1-1-1, lifetime",{"$f":"C22*$C$15","v":544446000},{"$f":"D22*$C$15","v":782641125},313056450,"USD/lifetime","Calculated"]
[null,"LEU burnup in LWR",40,null,null,"GWd/ton fuel","Pros and Cons Analysis of HALEU Utilization","\"once-through Light Water Reactors (OT-LWRs) with <5% low-enriched uranium and 50 GWd/t burnup\""]
[null,"Thermal efficiency",35,null,null,"percent","NRC Greenhouse Gas Emissions Estimates for a Reference 1,000 MWE Reactor; Abliene Christian University Molten Salt Research Reactor","35% efficiency re: NRC GHG emissions study"]
[null,"Lifetime energy production",{"$f":"C24*C15/C12*24*C25/100","v":372817021.27659577},null,null,"MWh/lifetime","Calculated"]
[null,"Total lifetime cost through fabrication",{"$f":"C16+C18+C21+C23","v":4029311675.1805553},{"$f":"D16+D18+D21+D23","v":6553653786.3999996},{"$f":"E16+E18+E21+E23","v":1856466943.0650001},"USD/lifetime","Calculated"]
[null,"LCOF in 2025 dollars",{"$f":"C27/$C$26","v":10.80774601273148},{"$f":"D27/$C$26","v":17.578740809523808},{"$f":"E27/$C$26","v":4.9795659455357137},"USD/MWh","Calculated"]
[]
[null,"HALEU Metal Fuel (U-Zr example)"]
[null,"Value description","Default","Upper ","Lower","Units","Source(s)","Notes"]
[null,"Fuel mass fraction - U",0.9,null,null,"kg U/kg U-Zr fuel","Placeholder"]
[null,"Natural Uranium Milling and Mining Cost, Line A1, unit",{"$f":"8120","v":8120},{"$f":"296*(1+$C$8/100)*40.6","v":15682.967999999999},{"$f":"34*(1+$C$8/100)*40.6","v":1801.422},"USD/kg enriched U","NIA HALEU Cost Report 2023 (upper and lower); Adv Fuel Cycle Cost Basis 2017 (default)","From Table 3 in NIA HALEU Cost Report"]
[null,"Natural U input, lifetime",{"$f":"C35*40.6","v":10613251.139240507},null,null,"kg natural U/lifetime","NIA HALEU Cost Report 2023","0.71% to 19.75% enrichment (HALEU), 40.6 kg new natural enrichment U for every 1 kg HALEU"]
[null,"Enriched U input, lifetime",{"$f":"C15/(19.75/4.95)","v":261410.12658227849},null,null,"kg enriched U/lifetime","Assumption","assumed that only ~1/4 of the uranium is needed for equilvalent-to-UO2 energy output since the enrichment was quadrupled, gets us to a similar lifetime energy production"]
[null,"Natural Uranium Milling and Mining Cost, Line A1, lifetime",{"$f":"C33*C35","v":2122650227.8481014},{"$f":"D33*C35","v":4099686650.0658226},{"$f":"E33*C35","v":470909953.04810131},"USD/lifetime","Calculated"]
[null,"Conversion Cost, Line B, unit",{"$f":"AVERAGE(D37:E37)","v":1085.6947500000001},{"$f":"1827","v":1827},{"$f":"6.5*(1+$C$8/100)*40.6","v":344.3895},"USD/kg enriched U","NIA HALEU Cost Report 2023 (upper); Adv Fuel Cycle Cost Basis 2017 (lower)","From Table 3 in NIA HALEU Cost Report"]
[null,"Conversion Cost, Line B, lifetime",{"$f":"C37*$C$35","v":283811602.02721524},{"$f":"D37*$C$35","v":477596301.26582283},90026902.788607597,"USD/lifetime","Calculated"]
[null,"Enrichment, Line C1, unit",{"$f":"AVERAGE(D39:E39)","v":26952.5},42520,11385,"USD/kg enriched U","NIA HALEU Cost Report 2023","Default is mean of two values"]
[null,"Separative work units (SWUs) required for enrichment, lifetime",{"$f":"42.52*C35","v":11115158.582278483},null,null,"SWUs/lifetime","NIA HALEU Cost Report 2023","0.71 to 19.75% enrichment, 40.6 SWUs/1 kg HALEU"]
{"$rows_left_out":29}